Reaction Details
TargetLysophosphatidic acid receptor 3
LigandBDBM50176396
Substrate/Competitorn/a
Meas. Tech.ChEMBL_333864 (CHEMBL865902)
IC50 414±n/a nM
Citation Durgam, GGTsukahara, RMakarova, NWalker, MDFujiwara, YPigg, KRBaker, DLSardar, VMParrill, ALTigyi, GMiller, DD Synthesis and pharmacological evaluation of second-generation phosphatidic acid derivatives as lysophosphatidic acid receptor ligands. Bioorg Med Chem Lett16:633-40 (2005) 
 
Lysophosphatidic acid receptor 3
Name:Lysophosphatidic acid receptor 3
Type:Enzyme
Mol. Mass.:40149.72
Organism:Homo sapiens (Human)
Description:Q9UBY5
Residue:353
BDBM50176396
NameBDBM50176396
Synonyms:CHEMBL204037 phosphoric acid mono-((S)-2-octanoylamino-2-octylcarbamoyl-ethyl) ester
TypeSmall organic molecule
Emp. Form.C19H39N2O6P
Mol. Mass.422.4965
SMILESCCCCCCCCNC(=O)[C@H](COP(O)(O)=O)NC(=O)CCCCCCC