Reaction Details
TargetLysophosphatidic acid receptor 1
LigandBDBM50176391
Substrate/Competitorn/a
Meas. Tech.ChEMBL_333862 (CHEMBL864091)
Ki 407±n/a nM
Citation Durgam, GGTsukahara, RMakarova, NWalker, MDFujiwara, YPigg, KRBaker, DLSardar, VMParrill, ALTigyi, GMiller, DD Synthesis and pharmacological evaluation of second-generation phosphatidic acid derivatives as lysophosphatidic acid receptor ligands. Bioorg Med Chem Lett16:633-40 (2005) 
 
Lysophosphatidic acid receptor 1
Name:Lysophosphatidic acid receptor 1
Type:Enzyme
Mol. Mass.:41120.55
Organism:Homo sapiens (Human)
Description:Q92633
Residue:364
BDBM50176391
NameBDBM50176391
Synonyms:CHEMBL202185 | octanoic acid (R)-2-octanoyloxy-3-phosphonooxy-propyl ester
TypeSmall organic molecule
Emp. Form.C19H37O8P
Mol. Mass.424.466
SMILESCCCCCCCC(=O)OC[C@H](COP(O)(O)=O)OC(=O)CCCCCCC