Reaction Details
TargetLysophosphatidic acid receptor 1
LigandBDBM50176398
Substrate/Competitorn/a
Meas. Tech.ChEMBL_333862 (CHEMBL864091)
IC50 328±n/a nM
Citation Durgam, GGTsukahara, RMakarova, NWalker, MDFujiwara, YPigg, KRBaker, DLSardar, VMParrill, ALTigyi, GMiller, DD Synthesis and pharmacological evaluation of second-generation phosphatidic acid derivatives as lysophosphatidic acid receptor ligands. Bioorg Med Chem Lett16:633-40 (2005) 
 
Lysophosphatidic acid receptor 1
Name:Lysophosphatidic acid receptor 1
Type:Enzyme
Mol. Mass.:41120.55
Organism:Homo sapiens (Human)
Description:Q92633
Residue:364
BDBM50176398
NameBDBM50176398
Synonyms:(S)-O-2,3-bis(octyloxy)propyl O,O-dihydrogen phosphorothioate | CHEMBL427017
TypeSmall organic molecule
Emp. Form.C19H41O5PS
Mol. Mass.412.565
SMILESCCCCCCCCOC[C@@H](COP(O)(O)=S)OCCCCCCCC