Reaction Details
TargetLysophosphatidic acid receptor 3
LigandBDBM50176397
Substrate/Competitorn/a
Meas. Tech.ChEMBL_333864 (CHEMBL865902)
IC50 143±n/a nM
Citation Durgam, GGTsukahara, RMakarova, NWalker, MDFujiwara, YPigg, KRBaker, DLSardar, VMParrill, ALTigyi, GMiller, DD Synthesis and pharmacological evaluation of second-generation phosphatidic acid derivatives as lysophosphatidic acid receptor ligands. Bioorg Med Chem Lett16:633-40 (2005) 
 
Lysophosphatidic acid receptor 3
Name:Lysophosphatidic acid receptor 3
Type:Enzyme
Mol. Mass.:40149.72
Organism:Homo sapiens (Human)
Description:Q9UBY5
Residue:353
BDBM50176397
NameBDBM50176397
Synonyms:CHEMBL203986 | nonanoic acid (S)-2-nonanoyloxy-3-phosphonooxy-propyl ester
TypeSmall organic molecule
Emp. Form.C19H41O6P
Mol. Mass.396.499
SMILESCCCCCCCCOC[C@@H](COP(O)(O)=O)OCCCCCCCC