Reaction Details
TargetCannabinoid receptor 2
LigandBDBM50176417
Substrate/Competitorn/a
Meas. Tech.ChEMBL_333261 (CHEMBL859080)
Ki>10000±n/a nM
Citation Carpino, PAGriffith, DASakya, SDow, RLBlack, SCHadcock, JRIredale, PAScott, DOFichtner, MWRose, CRDay, RDibrino, JButler, MDebartolo, DBDutcher, DGautreau, DLizano, JSO'connor, RESands, MAKelly-Sullivan, DWard, KM New bicyclic cannabinoid receptor-1 (CB1-R) antagonists. Bioorg Med Chem Lett16:731-6 (2005) 
 
Cannabinoid receptor 2
Name:Cannabinoid receptor 2
Type:G Protein-Coupled Receptor (GPCR)
Mol. Mass.:39690.94
Organism:Homo sapiens (Human)
Description:P34972
Residue:360
BDBM50176417
NameBDBM50176417
Synonyms:2-(2-chlorophenyl)-3-(4-chlorophenyl)-6-cyclohexyl-2H-pyrazolo[4,3-d]pyrimidin-7(6H)-one | CHEMBL370560
TypeSmall organic molecule
Emp. Form.C23H20Cl2N4O
Mol. Mass.439.337
SMILESClc1ccc(cc1)-c1n(nc2c1ncn(C1CCCCC1)c2=O)-c1ccccc1Cl