Reaction Details
TargetCannabinoid receptor 1
LigandBDBM50176416
Substrate/Competitorn/a
Meas. Tech.ChEMBL_333260 (CHEMBL859079)
Ki 1±n/a nM
Citation Carpino, PAGriffith, DASakya, SDow, RLBlack, SCHadcock, JRIredale, PAScott, DOFichtner, MWRose, CRDay, RDibrino, JButler, MDebartolo, DBDutcher, DGautreau, DLizano, JSO'connor, RESands, MAKelly-Sullivan, DWard, KM New bicyclic cannabinoid receptor-1 (CB1-R) antagonists. Bioorg Med Chem Lett16:731-6 (2005) 
 
Cannabinoid receptor 1
Name:Cannabinoid receptor 1
Type:G Protein-Coupled Receptor (GPCR)
Mol. Mass.:52868.96
Organism:Homo sapiens (Human)
Description:P21554
Residue:472
BDBM50176416
NameBDBM50176416
Synonyms:2-(2-chlorophenyl)-3-(4-chlorophenyl)-5-ethyl-6-(2,2,2-trifluoroethyl)-2H-pyrazolo[4,3-d]pyrimidin-7(6H)-one | CHEMBL425762
TypeSmall organic molecule
Emp. Form.C21H15Cl2F3N4O
Mol. Mass.467.271
SMILESCCc1nc2c(-c3ccc(Cl)cc3)n(nc2c(=O)n1CC(F)(F)F)-c1ccccc1Cl