Reaction Details
TargetCannabinoid receptor 1
LigandBDBM29061
Substrate/Competitorn/a
Meas. Tech.ChEMBL_333260 (CHEMBL859079)
Ki 0.6±n/a nM
Citation Carpino, PAGriffith, DASakya, SDow, RLBlack, SCHadcock, JRIredale, PAScott, DOFichtner, MWRose, CRDay, RDibrino, JButler, MDebartolo, DBDutcher, DGautreau, DLizano, JSO'connor, RESands, MAKelly-Sullivan, DWard, KM New bicyclic cannabinoid receptor-1 (CB1-R) antagonists. Bioorg Med Chem Lett16:731-6 (2005) 
 
Cannabinoid receptor 1
Name:Cannabinoid receptor 1
Type:G Protein-Coupled Receptor (GPCR)
Mol. Mass.:52868.96
Organism:Homo sapiens (Human)
Description:P21554
Residue:472
BDBM29061
NameBDBM29061
Synonyms:CHEMBL201602 | pyrazolopyrimidinone-based antagonist, 3
Typen/a
Emp. Form.C20H13Cl2F3N4O
Mol. Mass.453.245
SMILESCc1nc2c(-c3ccc(Cl)cc3)n(nc2c(=O)n1CC(F)(F)F)-c1ccccc1Cl