Reaction Details
TargetCannabinoid receptor 2
LigandBDBM50176433
Substrate/Competitorn/a
Meas. Tech.ChEMBL_332950 (CHEMBL854080)
IC50 3600±n/a nM
Citation Debenham, JSMadsen-Duggan, CBWalsh, TFWang, JTong, XDoss, GALao, JFong, TMSchaeffer, MTXiao, JCHuang, CRShen, CPFeng, YMarsh, DJStribling, DSShearman, LPStrack, AMMacIntyre, DEVan der Ploeg, LHGoulet, MT Synthesis of functionalized 1,8-naphthyridinones and their evaluation as novel, orally active CB1 receptor inverse agonists. Bioorg Med Chem Lett16:681-5 (2005) 
 
Cannabinoid receptor 2
Name:Cannabinoid receptor 2
Type:G Protein-Coupled Receptor (GPCR)
Mol. Mass.:39690.94
Organism:Homo sapiens (Human)
Description:P34972
Residue:360
BDBM50176433
NameBDBM50176433
Synonyms:CHEMBL202201 | N-(3-acetyl-6-(4-chlorophenyl)-7-(2,4-dichlorophenyl)-1-methyl-2-oxo-1,2-dihydro-1,8-naphthyridin-4-yl)-2-hydroxyacetamide
TypeSmall organic molecule
Emp. Form.C25H18Cl3N3O4
Mol. Mass.530.787
SMILESCC(=O)c1c(NC(=O)CO)c2cc(-c3ccc(Cl)cc3)c(nc2n(C)c1=O)-c1ccc(Cl)cc1Cl