Reaction Details
TargetD(3) dopamine receptor
LigandBDBM50176446
Substrate/Competitorn/a
Meas. Tech.ChEMBL_332996 (CHEMBL853593)
Ki 3.4±n/a nM
Citation Geneste, HBackfisch, GBraje, WDelzer, JHaupt, AHutchins, CWKing, LLLubisch, WSteiner, GTeschendorf, HJUnger, LWernet, W Synthesis and SAR of highly potent and selective dopamine D(3)-receptor antagonists: Quinolin(di)one and benzazepin(di)one derivatives. herve.geneste@abbott.com. Bioorg Med Chem Lett16:658-62 (2005) 
 
D(3) dopamine receptor
Name:D(3) dopamine receptor
Type:n/a
Mol. Mass.:44243.43
Organism:Homo sapiens (Human)
Description:n/a
Residue:400
BDBM50176446
NameBDBM50176446
Synonyms:1-(4-(4-(2-tert-butyl-6-(trifluoromethyl)pyrimidin-4-yl)piperazin-1-yl)butyl)-3,4-dihydroquinolin-2(1H)-one | CHEMBL383205
TypeSmall organic molecule
Emp. Form.C26H34F3N5O
Mol. Mass.489.5763
SMILESCC(C)(C)c1nc(cc(n1)C(F)(F)F)N1CCN(CCCCN2C(=O)CCc3ccccc23)CC1