Reaction Details
TargetRNA-directed RNA polymerase
LigandBDBM50176484
Substrate/Competitorn/a
Meas. Tech.ChEMBL_329786 (CHEMBL864623)
IC50>20000±n/a nM
Citation Gopalsamy, AAplasca, ACiszewski, GPark, KEllingboe, JWOrlowski, MFeld, BHowe, AY Design and synthesis of 3,4-dihydro-1H-[1]-benzothieno[2,3-c]pyran and 3,4-dihydro-1H-pyrano[3,4-b]benzofuran derivatives as non-nucleoside inhibitors of HCV NS5B RNA dependent RNA polymerase. Bioorg Med Chem Lett16:457-60 (2005) 
 
RNA-directed RNA polymerase
Name:RNA-directed RNA polymerase
Type:Protein
Mol. Mass.:25173.95
Organism:Hepatitis C virus
Description:Q8JXU8
Residue:229
BDBM50176484
NameBDBM50176484
Synonyms:(1-propyl-3,4-dihydro-1H-benzo[4,5]furo[2,3-c]pyran-1-yl)-acetic acid | CHEMBL370569
TypeSmall organic molecule
Emp. Form.C16H18O4
Mol. Mass.274.3117
SMILESCCCC1(CC(O)=O)OCCc2c1oc1ccccc21