Reaction Details
TargetDual specificity calcium/calmodulin-dependent 3',5'-cyclic nucleotide phosphodiesterase 1A/1B/1C
LigandBDBM50176521
Substrate/Competitorn/a
Meas. Tech.ChEMBL_327535 (CHEMBL854350)
IC50>16000±n/a nM
Citation Chambers, RJAbrams, KGarceau, NYKamath, AVManley, CMLilley, SCOtte, DAScott, DOSheils, ALTess, DAVellekoop, ASZhang, YLam, KT A new chemical tool for exploring the physiological function of the PDE2 isozyme. Bioorg Med Chem Lett16:307-10 (2005) 
 
Dual specificity calcium/calmodulin-dependent 3',5'-cyclic nucleotide phosphodiesterase 1A/1B/1C
Name:Dual specificity calcium/calmodulin-dependent 3',5'-cyclic nucleotide phosphodiesterase 1A/1B/1C
Synonyms:Phosphodiesterase 1
Type:n/a
Mol. Mass.:n/a
Description:Combinations of UniProts
Components:This complex has 3 components.
Component 1
Name:Dual specificity calcium/calmodulin-dependent 3',5'-cyclic nucleotide phosphodiesterase 1C
Type:Enzyme
Mol. Mass.:80778.58
Organism:Homo sapiens (Human)
Description:Q14123
Residue:709
Component 2
Name:Dual specificity calcium/calmodulin-dependent 3',5'-cyclic nucleotide phosphodiesterase 1A
Synonyms:61 kDa Cam-PDE Cam-PDE 1A PDE1A_HUMAN | hCam-1
Type:Protein
Mol. Mass.:61245.69
Organism:Homo sapiens (Human)
Description:P54750
Residue:535
Component 3
Name:Dual specificity calcium/calmodulin-dependent 3',5'-cyclic nucleotide phosphodiesterase 1B
Synonyms:63 kDa Cam-PDE Calcium/calmodulin-dependent 3',5'-cyclic nucleotide phosphodiesterase 1B PDE1B PDE1B_HUMAN Phosphodiesterase 1B Phosphodiesterase Type 1 (PDE1B) | Phosphodiesterase, PDE1/PDE5
Type:Enzyme
Mol. Mass.:61366.51
Organism:Homo sapiens (Human)
Description:n/a
Residue:536
BDBM50176521
NameBDBM50176521
Synonyms:5-methyl-6-oxo-6,7-dihydro-5H-furo[2,3-f]indole-7-carboxylic acid [1,3,4]thiadiazol-2-ylamide | CHEMBL200906
TypeSmall organic molecule
Emp. Form.C14H10N4O3S
Mol. Mass.314.319
SMILESCN1C(=O)C(C(=O)Nc2nncs2)c2cc3occc3cc12