Reaction Details
TargetcGMP-specific 3',5'-cyclic phosphodiesterase
LigandBDBM50176521
Substrate/Competitorn/a
Meas. Tech.ChEMBL_327542 (CHEMBL854357)
IC50>16000±n/a nM
Citation Chambers, RJAbrams, KGarceau, NYKamath, AVManley, CMLilley, SCOtte, DAScott, DOSheils, ALTess, DAVellekoop, ASZhang, YLam, KT A new chemical tool for exploring the physiological function of the PDE2 isozyme. Bioorg Med Chem Lett16:307-10 (2005) 
 
cGMP-specific 3',5'-cyclic phosphodiesterase
Name:cGMP-specific 3',5'-cyclic phosphodiesterase
Type:Protein
Mol. Mass.:99975.83
Organism:Homo sapiens (Human)
Description:O76074
Residue:875
BDBM50176521
NameBDBM50176521
Synonyms:5-methyl-6-oxo-6,7-dihydro-5H-furo[2,3-f]indole-7-carboxylic acid [1,3,4]thiadiazol-2-ylamide | CHEMBL200906
TypeSmall organic molecule
Emp. Form.C14H10N4O3S
Mol. Mass.314.319
SMILESCN1C(=O)C(C(=O)Nc2nncs2)c2cc3occc3cc12