Reaction Details
TargetcAMP-specific 3',5'-cyclic phosphodiesterase 4A
LigandBDBM28393
Substrate/Competitorn/a
Meas. Tech.ChEMBL_327538 (CHEMBL854353)
IC50>16000±n/a nM
Citation Chambers, RJAbrams, KGarceau, NYKamath, AVManley, CMLilley, SCOtte, DAScott, DOSheils, ALTess, DAVellekoop, ASZhang, YLam, KT A new chemical tool for exploring the physiological function of the PDE2 isozyme. Bioorg Med Chem Lett16:307-10 (2005) 
 
cAMP-specific 3',5'-cyclic phosphodiesterase 4A
Name:cAMP-specific 3',5'-cyclic phosphodiesterase 4A
Type:Enzyme
Mol. Mass.:98113.27
Organism:Homo sapiens (Human)
Description:P27815
Residue:886
BDBM28393
NameBDBM28393
Synonyms:(+)-EHNA CHEMBL296435
TypeSmall organic molecule
Emp. Form.C14H23N5O
Mol. Mass.277.3653
SMILESCCCCCC[C@H]([C@H](C)O)n1cnc2c(N)ncnc12