Reaction Details
TargetPeroxisome proliferator-activated receptor gamma
LigandBDBM50176607
Substrate/Competitorn/a
Meas. Tech.ChEMBL_332325 (CHEMBL865192)
EC50>10000±n/a nM
Citation Kasuga, JMakishima, MHashimoto, YMiyachi, H Design and synthesis of substituted phenylpropanoic acid derivatives as human peroxisome proliferator-activated receptor alpha/delta dual agonists. Bioorg Med Chem Lett16:554-8 (2005) 
 
Peroxisome proliferator-activated receptor gamma
Name:Peroxisome proliferator-activated receptor gamma
Type:Nuclear Receptor
Mol. Mass.:57613.46
Organism:Homo sapiens (Human)
Description:P37231
Residue:505
BDBM50176607
NameBDBM50176607
Synonyms:2-(3-((4-fluoro-3-(trifluoromethyl)benzamido)methyl)-4-methoxybenzyl)butanoic acid | CHEMBL426483
TypeSmall organic molecule
Emp. Form.C21H21F4NO4
Mol. Mass.427.3894
SMILESCCC(Cc1ccc(OC)c(CNC(=O)c2ccc(F)c(c2)C(F)(F)F)c1)C(O)=O