Reaction Details
TargetPeroxisome proliferator-activated receptor gamma
LigandBDBM50131739
Substrate/Competitorn/a
Meas. Tech.ChEMBL_332325 (CHEMBL865192)
EC50 2000±n/a nM
Citation Kasuga, JMakishima, MHashimoto, YMiyachi, H Design and synthesis of substituted phenylpropanoic acid derivatives as human peroxisome proliferator-activated receptor alpha/delta dual agonists. Bioorg Med Chem Lett16:554-8 (2005) 
 
Peroxisome proliferator-activated receptor gamma
Name:Peroxisome proliferator-activated receptor gamma
Type:Nuclear Receptor
Mol. Mass.:57613.46
Organism:Homo sapiens (Human)
Description:P37231
Residue:505
BDBM50131739
NameBDBM50131739
Synonyms:(+/-)-2-(4-methoxy-3-((4-(trifluoromethyl)benzamido)methyl)benzyl)butanoic acid 2-{4-Methoxy-3-[(4-trifluoromethyl-benzoylamino)-methyl]-benzyl}-butyric acid CHEMBL118939
TypeSmall organic molecule
Emp. Form.C21H22F3NO4
Mol. Mass.409.3989
SMILESCCC(Cc1ccc(OC)c(CNC(=O)c2ccc(cc2)C(F)(F)F)c1)C(O)=O