Reaction Details
TargetPeroxisome proliferator-activated receptor alpha
LigandBDBM50176608
Substrate/Competitorn/a
Meas. Tech.ChEMBL_332323 (CHEMBL867015)
EC50 10±n/a nM
Citation Kasuga, JMakishima, MHashimoto, YMiyachi, H Design and synthesis of substituted phenylpropanoic acid derivatives as human peroxisome proliferator-activated receptor alpha/delta dual agonists. Bioorg Med Chem Lett16:554-8 (2005) 
 
Peroxisome proliferator-activated receptor alpha
Name:Peroxisome proliferator-activated receptor alpha
Type:Enzyme
Mol. Mass.:52222.08
Organism:Homo sapiens (Human)
Description:Q07869
Residue:468
BDBM50176608
NameBDBM50176608
Synonyms:(2S)-2-{3-[({[2-fluoro-4-(trifluoromethyl)phenyl]carbonyl}amino)methyl]-4-methoxybenzyl}butanoic acid CHEMBL202609
TypeSmall organic molecule
Emp. Form.C21H21F4NO4
Mol. Mass.427.3894
SMILESCC[C@@H](Cc1ccc(OC)c(CNC(=O)c2ccc(cc2F)C(F)(F)F)c1)C(O)=O