Reaction Details
TargetPeroxisome proliferator-activated receptor gamma
LigandBDBM50176609
Substrate/Competitorn/a
Meas. Tech.ChEMBL_332325 (CHEMBL865192)
EC50>10000±n/a nM
Citation Kasuga, JMakishima, MHashimoto, YMiyachi, H Design and synthesis of substituted phenylpropanoic acid derivatives as human peroxisome proliferator-activated receptor alpha/delta dual agonists. Bioorg Med Chem Lett16:554-8 (2005) 
 
Peroxisome proliferator-activated receptor gamma
Name:Peroxisome proliferator-activated receptor gamma
Type:Nuclear Receptor
Mol. Mass.:57613.46
Organism:Homo sapiens (Human)
Description:P37231
Residue:505
BDBM50176609
NameBDBM50176609
Synonyms:(R)-2-(3-((3-fluoro-4-(trifluoromethyl)benzamido)methyl)-4-methoxybenzyl)butanoic acid | CHEMBL382655
TypeSmall organic molecule
Emp. Form.C21H21F4NO4
Mol. Mass.427.3894
SMILESCC[C@H](Cc1ccc(OC)c(CNC(=O)c2ccc(c(F)c2)C(F)(F)F)c1)C(O)=O