Reaction Details
TargetPeroxisome proliferator-activated receptor gamma
LigandBDBM50107546
Substrate/Competitorn/a
Meas. Tech.ChEMBL_332325 (CHEMBL865192)
EC50 3000±n/a nM
Citation Kasuga, JMakishima, MHashimoto, YMiyachi, H Design and synthesis of substituted phenylpropanoic acid derivatives as human peroxisome proliferator-activated receptor alpha/delta dual agonists. Bioorg Med Chem Lett16:554-8 (2005) 
 
Peroxisome proliferator-activated receptor gamma
Name:Peroxisome proliferator-activated receptor gamma
Type:Nuclear Receptor
Mol. Mass.:57613.46
Organism:Homo sapiens (Human)
Description:P37231
Residue:505
BDBM50107546
NameBDBM50107546
Synonyms:2-(3-((4-(trifluoromethyl)benzyl)carbamoyl)-4-methoxybenzyl)butanoic acid 2-[4-Methoxy-3-(4-trifluoromethyl-benzylcarbamoyl)-benzyl]-butyric acid | CHEMBL120009
TypeSmall organic molecule
Emp. Form.C21H22F3NO4
Mol. Mass.409.3989
SMILESCCC(Cc1ccc(OC)c(c1)C(=O)NCc1ccc(cc1)C(F)(F)F)C(O)=O