Reaction Details
TargetPeroxisome proliferator-activated receptor gamma
LigandBDBM50176616
Substrate/Competitorn/a
Meas. Tech.ChEMBL_327489 (CHEMBL861781)
EC50 104±n/a nM
Citation Lowe, DBBifulco, NBullock, WHClaus, TCoish, PDai, MDela Cruz, FEDickson, DFan, DHoover-Litty, HLi, TMa, XMannelly, GMonahan, MKMuegge, IO'Connor, SRodriguez, MShelekhin, TStolle, ASweet, LWang, MWang, YZhang, CZhang, HJZhang, MZhao, KZhao, QZhu, JZhu, LTsutsumi, M Substituted indanylacetic acids as PPAR-alpha-gamma activators. Bioorg Med Chem Lett16:297-301 (2005) 
 
Peroxisome proliferator-activated receptor gamma
Name:Peroxisome proliferator-activated receptor gamma
Type:Nuclear Receptor
Mol. Mass.:57613.46
Organism:Homo sapiens (Human)
Description:P37231
Residue:505
BDBM50176616
NameBDBM50176616
Synonyms:2-(5-(2-(2-((4-chlorophenoxy)methyl)-5-methyloxazol-4-yl)ethoxy)-2,3-dihydro-1H-inden-1-yl)butanoic acid | CHEMBL371764
TypeSmall organic molecule
Emp. Form.C26H28ClNO5
Mol. Mass.469.957
SMILESCCC(C1CCc2cc(OCCc3nc(COc4ccc(Cl)cc4)oc3C)ccc12)C(O)=O