Reaction Details
TargetGamma-aminobutyric acid receptor subunit alpha-1/beta-3/gamma-2
LigandBDBM50176774
Substrate/Competitorn/a
Meas. Tech.ChEMBL_430691 (CHEMBL919087)
Ki 0.78±n/a nM
Citation Carling, RWMadin, AGuiblin, ARussell, MGMoore, KWMitchinson, ASohal, BPike, ACook, SMRagan, ICMcKernan, RMQuirk, KFerris, PMarshall, GThompson, SAWafford, KADawson, GRAtack, JRHarrison, TCastro, JLStreet, LJ 7-(1,1-Dimethylethyl)-6-(2-ethyl-2H-1,2,4-triazol-3-ylmethoxy)-3-(2-fluorophenyl)-1,2,4-triazolo[4,3-b]pyridazine: a functionally selective gamma-aminobutyric acid(A) (GABA(A)) alpha2/alpha3-subtype selective agonist that exhibits potent anxiolytic activity but is not sedating in animal models. J Med Chem48:7089-92 (2005) 
 
Gamma-aminobutyric acid receptor subunit alpha-1/beta-3/gamma-2
Name:Gamma-aminobutyric acid receptor subunit alpha-1/beta-3/gamma-2
Type:Protein
Mol. Mass.:n/a
Description:n/a
Components:This complex has 3 components.
Component 1
Name:Gamma-aminobutyric acid receptor subunit alpha-1
Synonyms:Benzodiazepine central GABA A Benzodiazepine liver GABA(A) receptor subunit alpha-1 GABA-A receptor GBRA1_HUMAN TBPS | agonist GABA site
Type:Protein
Mol. Mass.:51817.35
Organism:Homo sapiens (Human)
Description:P14867
Residue:456
Component 2
Name:Gamma-aminobutyric acid receptor subunit beta-3
Synonyms:GABA A receptor alpha-4/beta-3/gamma-2 GABA-A receptor GBRB3_HUMAN | agonist GABA site
Type:PROTEIN
Mol. Mass.:54130.51
Organism:Homo sapiens (Human)
Description:ChEMBL_448071
Residue:473
Component 3
Name:Gamma-aminobutyric acid receptor subunit gamma-2
Synonyms:GABA(A) receptor subunit gamma-2 GBRG2_HUMAN
Type:PROTEIN
Mol. Mass.:54172.74
Organism:Homo sapiens (Human)
Description:EBI_217
Residue:467
BDBM50176774
NameBDBM50176774
Synonyms:3,7-diphenyl-6-(2-methyl-2H-1,2,4-triazol-3-yl-methoxy-1,2,4-triazolo[4,3-b]pyridazine | CHEMBL224175
TypeSmall organic molecule
Emp. Form.C21H17N7O
Mol. Mass.383.406
SMILESCn1ncnc1COc1nn2c(nnc2cc1-c1ccccc1)-c1ccccc1