Reaction Details
TargetGABA-A receptor; alpha-2/beta-3/gamma-2
LigandBDBM50176770
Substrate/Competitorn/a
Meas. Tech.ChEMBL_430692 (CHEMBL919088)
Ki 2.9±n/a nM
Citation Carling, RWMadin, AGuiblin, ARussell, MGMoore, KWMitchinson, ASohal, BPike, ACook, SMRagan, ICMcKernan, RMQuirk, KFerris, PMarshall, GThompson, SAWafford, KADawson, GRAtack, JRHarrison, TCastro, JLStreet, LJ 7-(1,1-Dimethylethyl)-6-(2-ethyl-2H-1,2,4-triazol-3-ylmethoxy)-3-(2-fluorophenyl)-1,2,4-triazolo[4,3-b]pyridazine: a functionally selective gamma-aminobutyric acid(A) (GABA(A)) alpha2/alpha3-subtype selective agonist that exhibits potent anxiolytic activity but is not sedating in animal models. J Med Chem48:7089-92 (2005) 
 
GABA-A receptor; alpha-2/beta-3/gamma-2
Name:GABA-A receptor; alpha-2/beta-3/gamma-2
Type:n/a
Mol. Mass.:n/a
Description:ASSAY_ID of ChEMBL is 2148174
Components:This complex has 3 components.
Component 1
Name:Gamma-aminobutyric acid receptor subunit gamma-2
Synonyms:GABA(A) receptor subunit gamma-2 GBRG2_HUMAN
Type:PROTEIN
Mol. Mass.:54172.74
Organism:Homo sapiens (Human)
Description:EBI_217
Residue:467
Component 2
Name:Gamma-aminobutyric acid receptor subunit beta-3
Synonyms:GABA A receptor alpha-4/beta-3/gamma-2 GABA-A receptor GBRB3_HUMAN | agonist GABA site
Type:PROTEIN
Mol. Mass.:54130.51
Organism:Homo sapiens (Human)
Description:ChEMBL_448071
Residue:473
Component 3
Name:Gamma-aminobutyric acid receptor subunit alpha-2
Synonyms:GABA receptor alpha-2 subunit GBRA2_HUMAN | Gamma-aminobutyric acid receptor subunit alpha-2 (GABRA2)
Type:Protein
Mol. Mass.:51338.78
Organism:Homo sapiens (Human)
Description:P47869
Residue:451
BDBM50176770
NameBDBM50176770
Synonyms:3,7-diphenyl-6-(2-pyridyl)methyloxy-1,2,4-triazolo[4,3-b]pyridazine | CHEMBL224134
TypeSmall organic molecule
Emp. Form.C23H17N5O
Mol. Mass.379.414
SMILESC(Oc1nn2c(nnc2cc1-c1ccccc1)-c1ccccc1)c1ccccn1