Reaction Details
TargetAdenosine receptor A1
LigandBDBM50176835
Substrate/Competitorn/a
Meas. Tech.ChEMBL_430786 (CHEMBL920042)
Ki 25±n/a nM
Citation Manetti, FSchenone, SBondavalli, FBrullo, CBruno, ORanise, AMosti, LMenozzi, GFossa, PTrincavelli, MLMartini, CMartinelli, ATintori, CBotta, M Synthesis and 3D QSAR of new pyrazolo[3,4-b]pyridines: potent and selective inhibitors of A1 adenosine receptors. J Med Chem48:7172-85 (2005) 
 
Adenosine receptor A1
Name:Adenosine receptor A1
Type:G Protein-Coupled Receptor (GPCR)
Mol. Mass.:36520.92
Organism:Homo sapiens (Human)
Description:P30542
Residue:326
BDBM50176835
NameBDBM50176835
Synonyms:CHEMBL223871 | ethyl 4-(4-methoxyphenethylamino)-1-(2-chloro-2-phenylethyl)-1H-pyrazolo[3,4-b]pyridine-5-carboxylate
TypeSmall organic molecule
Emp. Form.C26H27ClN4O3
Mol. Mass.478.971
SMILESCCOC(=O)c1cnc2n(CC(Cl)c3ccccc3)ncc2c1NCCc1ccc(OC)cc1