Reaction Details
TargetAdenosine receptor A1
LigandBDBM50176832
Substrate/Competitorn/a
Meas. Tech.ChEMBL_430784 (CHEMBL920040)
Ki 19±n/a nM
Citation Manetti, FSchenone, SBondavalli, FBrullo, CBruno, ORanise, AMosti, LMenozzi, GFossa, PTrincavelli, MLMartini, CMartinelli, ATintori, CBotta, M Synthesis and 3D QSAR of new pyrazolo[3,4-b]pyridines: potent and selective inhibitors of A1 adenosine receptors. J Med Chem48:7172-85 (2005) 
 
Adenosine receptor A1
Name:Adenosine receptor A1
Type:Enzyme Catalytic Domain
Mol. Mass.:36602.99
Organism:BOVINE
Description:ADENOSINE 0 BOVINE::P28190
Residue:326
BDBM50176832
NameBDBM50176832
Synonyms:CHEMBL224909 | ethyl 4-(4-chlorophenethylamino)-1-(2-chloro-2-phenylethyl)-1H-pyrazolo[3,4-b]pyridine-5-carboxylate
TypeSmall organic molecule
Emp. Form.C25H24Cl2N4O2
Mol. Mass.483.39
SMILESCCOC(=O)c1cnc2n(CC(Cl)c3ccccc3)ncc2c1NCCc1ccc(Cl)cc1