Reaction Details
TargetAdenosine receptor A1
LigandBDBM50176838
Substrate/Competitorn/a
Meas. Tech.ChEMBL_430784 (CHEMBL920040)
Ki 15±n/a nM
Citation Manetti, FSchenone, SBondavalli, FBrullo, CBruno, ORanise, AMosti, LMenozzi, GFossa, PTrincavelli, MLMartini, CMartinelli, ATintori, CBotta, M Synthesis and 3D QSAR of new pyrazolo[3,4-b]pyridines: potent and selective inhibitors of A1 adenosine receptors. J Med Chem48:7172-85 (2005) 
 
Adenosine receptor A1
Name:Adenosine receptor A1
Type:Enzyme Catalytic Domain
Mol. Mass.:36602.99
Organism:BOVINE
Description:ADENOSINE 0 BOVINE::P28190
Residue:326
BDBM50176838
NameBDBM50176838
Synonyms:1-(2-chloro-2-phenyl-ethyl)-4-(2-p-tolyl-ethylamino)-1H-pyrazolo[3,4-b]pyridine-5-carboxylic acid methyl ester | CHEMBL375558
TypeSmall organic molecule
Emp. Form.C25H25ClN4O2
Mol. Mass.448.945
SMILESCOC(=O)c1cnc2n(CC(Cl)c3ccccc3)ncc2c1NCCc1ccc(C)cc1