Reaction Details
TargetAdenosine receptor A1
LigandBDBM50176822
Substrate/Competitorn/a
Meas. Tech.ChEMBL_430791 (CHEMBL920047)
Ki 7.2±n/a nM
Citation Manetti, FSchenone, SBondavalli, FBrullo, CBruno, ORanise, AMosti, LMenozzi, GFossa, PTrincavelli, MLMartini, CMartinelli, ATintori, CBotta, M Synthesis and 3D QSAR of new pyrazolo[3,4-b]pyridines: potent and selective inhibitors of A1 adenosine receptors. J Med Chem48:7172-85 (2005) 
 
Adenosine receptor A1
Name:Adenosine receptor A1
Type:Enzyme Catalytic Domain
Mol. Mass.:36602.99
Organism:BOVINE
Description:ADENOSINE 0 BOVINE::P28190
Residue:326
BDBM50176822
NameBDBM50176822
Synonyms:CHEMBL375154 | isopropyl 4-(4-methoxyphenethylamino)-1-(2-chloro-2-phenylethyl)-1H-pyrazolo[3,4-b]pyridine-5-carboxylate
TypeSmall organic molecule
Emp. Form.C27H29ClN4O3
Mol. Mass.492.997
SMILESCOc1ccc(CCNc2c(cnc3n(CC(Cl)c4ccccc4)ncc23)C(=O)OC(C)C)cc1