Reaction Details
TargetAdenosine receptor A1
LigandBDBM50176822
Substrate/Competitorn/a
Meas. Tech.ChEMBL_430786 (CHEMBL920042)
Ki 17±n/a nM
Citation Manetti, FSchenone, SBondavalli, FBrullo, CBruno, ORanise, AMosti, LMenozzi, GFossa, PTrincavelli, MLMartini, CMartinelli, ATintori, CBotta, M Synthesis and 3D QSAR of new pyrazolo[3,4-b]pyridines: potent and selective inhibitors of A1 adenosine receptors. J Med Chem48:7172-85 (2005) 
 
Adenosine receptor A1
Name:Adenosine receptor A1
Type:G Protein-Coupled Receptor (GPCR)
Mol. Mass.:36520.92
Organism:Homo sapiens (Human)
Description:P30542
Residue:326
BDBM50176822
NameBDBM50176822
Synonyms:CHEMBL375154 | isopropyl 4-(4-methoxyphenethylamino)-1-(2-chloro-2-phenylethyl)-1H-pyrazolo[3,4-b]pyridine-5-carboxylate
TypeSmall organic molecule
Emp. Form.C27H29ClN4O3
Mol. Mass.492.997
SMILESCOc1ccc(CCNc2c(cnc3n(CC(Cl)c4ccccc4)ncc23)C(=O)OC(C)C)cc1