Reaction Details
TargetAdenosine receptor A1
LigandBDBM50176815
Substrate/Competitorn/a
Meas. Tech.ChEMBL_430784 (CHEMBL920040)
Ki 12±n/a nM
Citation Manetti, FSchenone, SBondavalli, FBrullo, CBruno, ORanise, AMosti, LMenozzi, GFossa, PTrincavelli, MLMartini, CMartinelli, ATintori, CBotta, M Synthesis and 3D QSAR of new pyrazolo[3,4-b]pyridines: potent and selective inhibitors of A1 adenosine receptors. J Med Chem48:7172-85 (2005) 
 
Adenosine receptor A1
Name:Adenosine receptor A1
Type:Enzyme Catalytic Domain
Mol. Mass.:36602.99
Organism:BOVINE
Description:ADENOSINE 0 BOVINE::P28190
Residue:326
BDBM50176815
NameBDBM50176815
Synonyms:CHEMBL225398 | ethyl 4-(4-fluorophenethylamino)-1-(2-chloro-2-phenylethyl)-1H-pyrazolo[3,4-b]pyridine-5-carboxylate
TypeSmall organic molecule
Emp. Form.C25H24ClFN4O2
Mol. Mass.466.935
SMILESCCOC(=O)c1cnc2n(CC(Cl)c3ccccc3)ncc2c1NCCc1ccc(F)cc1