Reaction Details
TargetAmyloid-beta precursor protein
LigandBDBM50079267
Substrate/Competitorn/a
Meas. Tech.ChEMBL_430882 (CHEMBL913951)
Ki>1000±n/a nM
Citation Ono, MYoshida, NIshibashi, KHaratake, MArano, YMori, HNakayama, M Radioiodinated flavones for in vivo imaging of beta-amyloid plaques in the brain. J Med Chem48:7253-60 (2005) 
 
Amyloid-beta precursor protein
Name:Amyloid-beta precursor protein
Type:Single-pass type I membrane protein
Mol. Mass.:86890.41
Organism:Homo sapiens (Human)
Description:P05067
Residue:770
BDBM50079267
NameBDBM50079267
Synonyms:Congo Red Kongorot disodium 3,3'-((1,1'-biphenyl)-4,4'-diylbis(azo))bis(4-aminonaphthalene-1-sulphonate) | disodium 3,3'-(biphenyl-4,4'-diyldidiazene-2,1-diyl)bis(4-aminonaphthalene-1-sulfonate)
TypeSmall organic molecule
Emp. Form.C32H22N6O6S2
Mol. Mass.650.685
SMILESNc1c(cc(c2ccccc12)S([O-])(=O)=O)\N=N\c1ccc(cc1)-c1ccc(cc1)\N=N\c1cc(c2ccccc2c1N)S([O-])(=O)=O