Reaction Details
TargetCannabinoid receptor 2
LigandBDBM50176988
Substrate/Competitorn/a
Meas. Tech.ChEMBL_430952 (CHEMBL914894)
Ki 21±n/a nM
Citation Murineddu, GRuiu, SLoriga, GManca, ILazzari, PReali, RPani, LToma, LPinna, GA Tricyclic pyrazoles. 3. Synthesis, biological evaluation, and molecular modeling of analogues of the cannabinoid antagonist 8-chloro-1-(2',4'-dichlorophenyl)-N-piperidin-1-yl-1,4,5,6-tetrahydrobenzo[6,7]cyclohepta[1,2-c]pyrazole-3-carboxamide. J Med Chem48:7351-62 (2005) 
 
Cannabinoid receptor 2
Name:Cannabinoid receptor 2
Type:Enzyme Catalytic Domain
Mol. Mass.:38220.43
Organism:MOUSE
Description:P47936
Residue:347
BDBM50176988
NameBDBM50176988
Synonyms:8-Chloro-1-(2,4-dichloro-phenyl)-1,3a,4,5,6,10b-hexahydro-1,2-diaza-benzo[e]azulene-3-carboxylic acid piperidin-1-ylamide 8-chloro-1-(2',4'-dichlorophenyl)-N-piperidin-1-yl-1,4,5,6-tetrahydrobenzo[6,7]cyclohepta[1,2-c]pyrazole-3-carboxamide CHEMBL376700
TypeSmall organic molecule
Emp. Form.C24H23Cl3N4O
Mol. Mass.489.825
SMILESClc1ccc(c(Cl)c1)-n1nc(C(=O)NN2CCCCC2)c2CCCc3cc(Cl)ccc3-c12