Reaction Details
TargetCannabinoid receptor 1
LigandBDBM50176990
Substrate/Competitorn/a
Meas. Tech.ChEMBL_430951 (CHEMBL914893)
Ki 0.013±n/a nM
Citation Murineddu, GRuiu, SLoriga, GManca, ILazzari, PReali, RPani, LToma, LPinna, GA Tricyclic pyrazoles. 3. Synthesis, biological evaluation, and molecular modeling of analogues of the cannabinoid antagonist 8-chloro-1-(2',4'-dichlorophenyl)-N-piperidin-1-yl-1,4,5,6-tetrahydrobenzo[6,7]cyclohepta[1,2-c]pyrazole-3-carboxamide. J Med Chem48:7351-62 (2005) 
 
Cannabinoid receptor 1
Name:Cannabinoid receptor 1
Type:Enzyme
Mol. Mass.:52842.52
Organism:Mus musculus (Mouse)
Description:P47746
Residue:473
BDBM50176990
NameBDBM50176990
Synonyms:8-chloro-1-(2',4'-dichlorophenyl)-N-p-methoxylphenyl-1,4,5,6-tetrahydrobenzo[6,7]cyclohepta[1,2-c]pyrazole-3-carboxamide | CHEMBL387112
TypeSmall organic molecule
Emp. Form.C26H20Cl3N3O2
Mol. Mass.512.815
SMILESCOc1ccc(NC(=O)c2nn(c-3c2CCCc2cc(Cl)ccc-32)-c2ccc(Cl)cc2Cl)cc1