Reaction Details
TargetMetabotropic glutamate receptor 1
LigandBDBM50177093
Substrate/Competitorn/a
Meas. Tech.ChEMBL_430991 (CHEMBL916419)
IC50 44±n/a nM
Citation Zheng, GZBhatia, PDaanen, JKolasa, TPatel, MLatshaw, SEl Kouhen, OFChang, RUchic, MEMiller, LNakane, MLehto, SGHonore, MPMoreland, RBBrioni, JDStewart, AO Structure-activity relationship of triazafluorenone derivatives as potent and selective mGluR1 antagonists. J Med Chem48:7374-88 (2005) 
 
Metabotropic glutamate receptor 1
Name:Metabotropic glutamate receptor 1
Type:Enzyme
Mol. Mass.:132358.19
Organism:Homo sapiens (Human)
Description:Q13255
Residue:1194
BDBM50177093
NameBDBM50177093
Synonyms:9-Dimethylamino-3-(4-ethyl-phenyl)-2-methyl-3H-pyrido[3',2':4,5]thieno[3,2-d]pyrimidin-4-one CHEMBL224673
TypeSmall organic molecule
Emp. Form.C20H20N4OS
Mol. Mass.364.464
SMILESCCc1ccc(cc1)-n1c(C)nc2c(sc3nccc(N(C)C)c23)c1=O