Reaction Details
TargetMetabotropic glutamate receptor 5
LigandBDBM50177063
Substrate/Competitorn/a
Meas. Tech.ChEMBL_430990 (CHEMBL916418)
Ki>100000±n/a nM
Citation Zheng, GZBhatia, PDaanen, JKolasa, TPatel, MLatshaw, SEl Kouhen, OFChang, RUchic, MEMiller, LNakane, MLehto, SGHonore, MPMoreland, RBBrioni, JDStewart, AO Structure-activity relationship of triazafluorenone derivatives as potent and selective mGluR1 antagonists. J Med Chem48:7374-88 (2005) 
 
Metabotropic glutamate receptor 5
Name:Metabotropic glutamate receptor 5
Type:Enzyme
Mol. Mass.:131900.14
Organism:Rattus norvegicus (Rat)
Description:P31424
Residue:1203
BDBM50177063
NameBDBM50177063
Synonyms:3-(4-Bromo-phenyl)-9-dimethylamino-3H-pyrido[3',2':4,5]thieno[3,2-d]pyrimidin-4-one CHEMBL225590
TypeSmall organic molecule
Emp. Form.C17H13BrN4OS
Mol. Mass.401.28
SMILESCN(C)c1ccnc2sc3c(ncn(-c4ccc(Br)cc4)c3=O)c12