Reaction Details
TargetMetabotropic glutamate receptor 5
LigandBDBM50177097
Substrate/Competitorn/a
Meas. Tech.ChEMBL_430990 (CHEMBL916418)
Ki 500±n/a nM
Citation Zheng, GZBhatia, PDaanen, JKolasa, TPatel, MLatshaw, SEl Kouhen, OFChang, RUchic, MEMiller, LNakane, MLehto, SGHonore, MPMoreland, RBBrioni, JDStewart, AO Structure-activity relationship of triazafluorenone derivatives as potent and selective mGluR1 antagonists. J Med Chem48:7374-88 (2005) 
 
Metabotropic glutamate receptor 5
Name:Metabotropic glutamate receptor 5
Type:Enzyme
Mol. Mass.:131900.14
Organism:Rattus norvegicus (Rat)
Description:P31424
Residue:1203
BDBM50177097
NameBDBM50177097
Synonyms:9-Dimethylamino-3-p-tolyl-3H-pyrido[3',2':4,5]thieno[3,2-d]pyrimidin-4-one CHEMBL223496
TypeSmall organic molecule
Emp. Form.C18H16N4OS
Mol. Mass.336.411
SMILESCN(C)c1ccnc2sc3c(ncn(-c4ccc(C)cc4)c3=O)c12