Reaction Details
TargetAcetylcholine receptor subunit epsilon
LigandBDBM50177174
Substrate/Competitorn/a
Meas. Tech.ChEMBL_431077 (CHEMBL917782)
IC50 125±n/a nM
Citation Kapková, PHeller, EUnger, MFolkers, GHolzgrabe, U Random chemistry as a new tool for the generation of small compound libraries: development of a new acetylcholinesterase inhibitor. J Med Chem48:7496-9 (2005) 
 
Acetylcholine receptor subunit epsilon
Name:Acetylcholine receptor subunit epsilon
Type:PROTEIN
Mol. Mass.:54686.87
Organism:Homo sapiens (Human)
Description:ChEMBL_431077
Residue:493
BDBM50177174
NameBDBM50177174
Synonyms:9-amino-5,6,7,8-tetrahydroacridin-4yl)methano | CHEMBL224906
TypeSmall organic molecule
Emp. Form.C14H16N2O
Mol. Mass.228.2896
SMILESNc1c2CCCCc2nc2c(CO)cccc12