Reaction Details
TargetAcetylcholine receptor subunit epsilon
LigandBDBM8961
Substrate/Competitorn/a
Meas. Tech.ChEMBL_431077 (CHEMBL917782)
IC50 44±n/a nM
Citation Kapková, PHeller, EUnger, MFolkers, GHolzgrabe, U Random chemistry as a new tool for the generation of small compound libraries: development of a new acetylcholinesterase inhibitor. J Med Chem48:7496-9 (2005) 
 
Acetylcholine receptor subunit epsilon
Name:Acetylcholine receptor subunit epsilon
Type:PROTEIN
Mol. Mass.:54686.87
Organism:Homo sapiens (Human)
Description:ChEMBL_431077
Residue:493
BDBM8961
NameBDBM8961
Synonyms:1,2,3,4-tetrahydro-9-acridinamine 9-THA CHEMBL1337960 Cognex Tracine cid_1935 | tacrine.HCl
TypeSmall organic molecule
Emp. Form.C13H14N2
Mol. Mass.198.2637
SMILESNc1c2CCCCc2nc2ccccc12