Reaction Details
TargetDimer of Protein farnesyltransferase subunit beta
LigandBDBM50177265
Substrate/Competitorn/a
Meas. Tech.ChEMBL_331931 (CHEMBL864674)
IC50 7.3±n/a nM
Citation Huang, CYStauffer, TMStrickland, CLReader, JCHuang, HLi, GCooper, ABDoll, RJGanguly, AKBaldwin, JJRokosz, LL Guiding farnesyltransferase inhibitors from an ECLiPS library to the catalytic zinc. Bioorg Med Chem Lett16:507-11 (2005) 
 
Dimer of Protein farnesyltransferase subunit beta
Name:Dimer of Protein farnesyltransferase subunit beta
Synonyms:Protein Farnesyltransferase (PFT) Chain B
Type:n/a
Mol. Mass.:n/a
Description:ASSAY_ID of EBI is 51428
Components:This complex has 3 components.
Component 1
Name:Protein farnesyltransferase subunit beta
Type:Enzyme Subunit
Mol. Mass.:48766.02
Organism:Homo sapiens (Human)
Description:Protein farnesyltransferase subunit beta
Residue:437
Component 2
Name:Protein farnesyltransferase subunit beta
Synonyms:CAAX farnesyltransferase subunit alpha FNTB FTase-alpha GGTase-I-alpha Protein farnesyl/geranylgeranyl transferase Protein farnesyltransferase subunit beta Protein farnesyltransferase/geranylgeranyltransferase type-1 subunit alpha Ras proteins prenyltransferase subunit beta | Type I protein geranyl-geranyltransferase subunit alpha
Type:Enzyme Subunit
Mol. Mass.:48766.02
Organism:Homo sapiens (Human)
Description:Protein farnesyltransferase subunit beta
Residue:437
BDBM50177265
NameBDBM50177265
Synonyms:4-(3-bromo-8-chloro-6,11-dihydro-5H-benzo[5,6]cyclohepta[1,2-b]pyridin-11-yl)-piperazine-1,2-dicarboxylicacid 1-cyclohexylamide 2-{[2-(3-methyl-3H-imidazol-4-yl)-ethyl]-amide} | CHEMBL371962
TypeSmall organic molecule
Emp. Form.C32H39BrClN7O2
Mol. Mass.669.055
SMILESCn1cncc1CCNC(=O)C1CN(CCN1C(=O)NC1CCCCC1)C1c2ccc(Cl)cc2CCc2cc(Br)cnc12