Reaction Details
TargetDimer of Protein farnesyltransferase subunit beta
LigandBDBM50177267
Substrate/Competitorn/a
Meas. Tech.ChEMBL_331931 (CHEMBL864674)
IC50 8±n/a nM
Citation Huang, CYStauffer, TMStrickland, CLReader, JCHuang, HLi, GCooper, ABDoll, RJGanguly, AKBaldwin, JJRokosz, LL Guiding farnesyltransferase inhibitors from an ECLiPS library to the catalytic zinc. Bioorg Med Chem Lett16:507-11 (2005) 
 
Dimer of Protein farnesyltransferase subunit beta
Name:Dimer of Protein farnesyltransferase subunit beta
Synonyms:Protein Farnesyltransferase (PFT) Chain B
Type:n/a
Mol. Mass.:n/a
Description:ASSAY_ID of EBI is 51428
Components:This complex has 3 components.
Component 1
Name:Protein farnesyltransferase subunit beta
Type:Enzyme Subunit
Mol. Mass.:48766.02
Organism:Homo sapiens (Human)
Description:Protein farnesyltransferase subunit beta
Residue:437
Component 2
Name:Protein farnesyltransferase subunit beta
Synonyms:CAAX farnesyltransferase subunit alpha FNTB FTase-alpha GGTase-I-alpha Protein farnesyl/geranylgeranyl transferase Protein farnesyltransferase subunit beta Protein farnesyltransferase/geranylgeranyltransferase type-1 subunit alpha Ras proteins prenyltransferase subunit beta | Type I protein geranyl-geranyltransferase subunit alpha
Type:Enzyme Subunit
Mol. Mass.:48766.02
Organism:Homo sapiens (Human)
Description:Protein farnesyltransferase subunit beta
Residue:437
BDBM50177267
NameBDBM50177267
Synonyms:4-(3-bromo-8-chloro-6,11-dihydro-5H-benzo[5,6]cyclohepta[1,2-b]pyridin-11-yl)-1-(6-oxo-heptanoyl)-piperazine-2-carboxylic acid (pyridin-3-ylmethyl)-amide | CHEMBL408569
TypeSmall organic molecule
Emp. Form.C32H35BrClN5O3
Mol. Mass.653.009
SMILESCC(=O)CCCCC(=O)N1CCN(CC1C(=O)NCc1cccnc1)C1c2ccc(Cl)cc2CCc2cc(Br)cnc12