Reaction Details
TargetMelanin-concentrating hormone receptor 1
LigandBDBM50177299
Substrate/Competitorn/a
Meas. Tech.ChEMBL_334677 (CHEMBL853089)
IC50 1.3±n/a nM
Citation Ulven, TLittle, PBReceveur, JMFrimurer, TMRist, ONørregaard, PKHögberg, T 6-Acylamino-2-amino-4-methylquinolines as potent melanin-concentrating hormone 1 receptor antagonists: structure-activity exploration of eastern and western parts. Bioorg Med Chem Lett16:1070-5 (2006) 
 
Melanin-concentrating hormone receptor 1
Name:Melanin-concentrating hormone receptor 1
Type:G Protein-Coupled Receptor (GPCR)
Mol. Mass.:45976.27
Organism:Homo sapiens (Human)
Description:Membranes from CHO-K1 cells stably expressing human MCH1R were used in assays.
Residue:422
BDBM50177299
NameBDBM50177299
Synonyms:CHEMBL204952 | N-(4-methyl-2-(2-morpholinoethylamino)quinolin-6-yl)-2-(4-(trifluoromethoxy)phenoxy)acetamide
TypeSmall organic molecule
Emp. Form.C25H27F3N4O4
Mol. Mass.504.5015
SMILESCc1cc(NCCN2CCOCC2)nc2ccc(NC(=O)COc3ccc(OC(F)(F)F)cc3)cc12