Reaction Details
TargetLysophosphatidic acid receptor 2
LigandBDBM50177328
Substrate/Competitorn/a
Meas. Tech.ChEMBL_329845 (CHEMBL862794)
EC50 1300±n/a nM
Citation Gududuru, VZeng, KTsukahara, RMakarova, NFujiwara, YPigg, KRBaker, DLTigyi, GMiller, DD Identification of Darmstoff analogs as selective agonists and antagonists of lysophosphatidic acid receptors. Bioorg Med Chem Lett16:451-6 (2005) 
 
Lysophosphatidic acid receptor 2
Name:Lysophosphatidic acid receptor 2
Type:PROTEIN
Mol. Mass.:39103.44
Organism:Homo sapiens (Human)
Description:ChEMBL_1451385
Residue:351
BDBM50177328
NameBDBM50177328
Synonyms:CHEMBL427014 | potassium O-((2S,4R)-2-(heptadec-9-enyl)-1,3-dioxolan-4-yl)methyl O-hydrogenphosphorothioate
TypeSmall organic molecule
Emp. Form.C21H40O5PS
Mol. Mass.435.579
SMILESCCCCCCC\C=C\CCCCCCCC[C@H]1OC[C@H](COP(O)([O-])=S)O1