Reaction Details
TargetD(3) dopamine receptor
LigandBDBM50177347
Substrate/Competitorn/a
Meas. Tech.ChEMBL_331690 (CHEMBL862890)
Ki 2.3±n/a nM
Citation Geneste, HBackfisch, GBraje, WDelzer, JHaupt, AHutchins, CWKing, LLKling, ATeschendorf, HJUnger, LWernet, W Synthesis and SAR of highly potent and selective dopamine D(3)-receptor antagonists: 1H-pyrimidin-2-one derivatives. Bioorg Med Chem Lett16:490-4 (2005) 
 
D(3) dopamine receptor
Name:D(3) dopamine receptor
Type:n/a
Mol. Mass.:44243.43
Organism:Homo sapiens (Human)
Description:n/a
Residue:400
BDBM50177347
NameBDBM50177347
Synonyms:1-(4-(4-(2-tert-butyl-6-(trifluoromethyl)pyrimidin-4-yl)piperazin-1-yl)butyl)-5-chloro-4-hydroxypyrimidin-2(1H)-one | CHEMBL201240
TypeSmall organic molecule
Emp. Form.C21H28ClF3N6O2
Mol. Mass.488.934
SMILESCC(C)(C)c1nc(cc(n1)C(F)(F)F)N1CCN(CCCCn2cc(Cl)c(=O)[nH]c2=O)CC1