Reaction Details
TargetD(3) dopamine receptor
LigandBDBM50177356
Substrate/Competitorn/a
Meas. Tech.ChEMBL_331690 (CHEMBL862890)
Ki 1.3±n/a nM
Citation Geneste, HBackfisch, GBraje, WDelzer, JHaupt, AHutchins, CWKing, LLKling, ATeschendorf, HJUnger, LWernet, W Synthesis and SAR of highly potent and selective dopamine D(3)-receptor antagonists: 1H-pyrimidin-2-one derivatives. Bioorg Med Chem Lett16:490-4 (2005) 
 
D(3) dopamine receptor
Name:D(3) dopamine receptor
Type:n/a
Mol. Mass.:44243.43
Organism:Homo sapiens (Human)
Description:n/a
Residue:400
BDBM50177356
NameBDBM50177356
Synonyms:1-(4-(4-(2-tert-butyl-6-(trifluoromethyl)pyrimidin-4-yl)piperazin-1-yl)butyl)-4-hydroxy-5-methylpyrimidin-2(1H)-one CHEMBL201115
TypeSmall organic molecule
Emp. Form.C22H31F3N6O2
Mol. Mass.468.5157
SMILESCc1cn(CCCCN2CCN(CC2)c2cc(nc(n2)C(C)(C)C)C(F)(F)F)c(=O)[nH]c1=O