Reaction Details
TargetSubstance-P receptor
LigandBDBM50177370
Substrate/Competitorn/a
Meas. Tech.ChEMBL_334652 (CHEMBL854118)
Ki 3.1±n/a nM
Citation Shue, HJChen, XSchwerdt, JHPaliwal, SBlythin, DJLin, LGu, DWang, CReichard, GAWang, HPiwinski, JJDuffy, RALachowicz, JECoffin, VLNomeir, AAMorgan, CAVarty, GBShih, NY Cyclic urea derivatives as potent NK1 selective antagonists. Part II: Effects of fluoro and benzylic methyl substitutions. Bioorg Med Chem Lett16:1065-9 (2006) 
 
Substance-P receptor
Name:Substance-P receptor
Type:G Protein-Coupled Receptor (GPCR)
Mol. Mass.:46254.43
Organism:Homo sapiens (Human)
Description:P25103
Residue:407
BDBM50177370
NameBDBM50177370
Synonyms:(R)-4-(((R)-1-(3,5-bis(trifluoromethyl)phenyl)ethoxy)methyl)-1-isopropyl-4-phenylimidazolidin-2-one | CHEMBL381524
TypeSmall organic molecule
Emp. Form.C23H24F6N2O2
Mol. Mass.474.4393
SMILESCC(C)N1C[C@](CO[C@H](C)c2cc(cc(c2)C(F)(F)F)C(F)(F)F)(NC1=O)c1ccccc1