Reaction Details
TargetSubstance-P receptor
LigandBDBM50177373
Substrate/Competitorn/a
Meas. Tech.ChEMBL_334652 (CHEMBL854118)
Ki 89±n/a nM
Citation Shue, HJChen, XSchwerdt, JHPaliwal, SBlythin, DJLin, LGu, DWang, CReichard, GAWang, HPiwinski, JJDuffy, RALachowicz, JECoffin, VLNomeir, AAMorgan, CAVarty, GBShih, NY Cyclic urea derivatives as potent NK1 selective antagonists. Part II: Effects of fluoro and benzylic methyl substitutions. Bioorg Med Chem Lett16:1065-9 (2006) 
 
Substance-P receptor
Name:Substance-P receptor
Type:G Protein-Coupled Receptor (GPCR)
Mol. Mass.:46254.43
Organism:Homo sapiens (Human)
Description:P25103
Residue:407
BDBM50177373
NameBDBM50177373
Synonyms:(S)-4-((3,5-bis(trifluoromethyl)benzyloxy)methyl)-4-(4-fluorophenyl)imidazolidin-2-one | CHEMBL204918
TypeSmall organic molecule
Emp. Form.C19H15F7N2O2
Mol. Mass.436.3234
SMILESFc1ccc(cc1)[C@@]1(COCc2cc(cc(c2)C(F)(F)F)C(F)(F)F)CNC(=O)N1