Reaction Details
Target4-aminobutyrate aminotransferase, mitochondrial
LigandBDBM26194
Substrate/Competitorn/a
Meas. Tech.ChEMBL_332431 (CHEMBL867027)
IC50>1000000±n/a nM
Citation Tao, YHYuan, ZTang, XQXu, HBYang, XL Inhibition of GABA shunt enzymes' activity by 4-hydroxybenzaldehyde derivatives. Bioorg Med Chem Lett16:592-5 (2005) 
 
4-aminobutyrate aminotransferase, mitochondrial
Name:4-aminobutyrate aminotransferase, mitochondrial
Type:PROTEIN
Mol. Mass.:56449.39
Organism:Homo sapiens (Human)
Description:ChEMBL_1459248
Residue:500
BDBM26194
NameBDBM26194
Synonyms:4-Hydroxybenzoate, III CHEMBL441343 phenol derivative, 8
TypeSmall organic molecule
Emp. Form.C7H6O3
Mol. Mass.138.1207
SMILESOC(=O)c1ccc(O)cc1