Reaction Details
TargetPoly [ADP-ribose] polymerase 1
LigandBDBM50177440
Substrate/Competitorn/a
Meas. Tech.ChEMBL_334702 (CHEMBL862536)
IC50 5±n/a nM
Citation Cockcroft, XLDillon, KJDixon, LDrzewiecki, JKerrigan, FLoh, VMMartin, NMMenear, KASmith, GC Phthalazinones 2: Optimisation and synthesis of novel potent inhibitors of poly(ADP-ribose)polymerase. Bioorg Med Chem Lett16:1040-4 (2006) 
 
Poly [ADP-ribose] polymerase 1
Name:Poly [ADP-ribose] polymerase 1
Type:n/a
Mol. Mass.:113114.22
Organism:Homo sapiens (Human)
Description:P09874
Residue:1014
BDBM50177440
NameBDBM50177440
Synonyms:4-(3-(1-cyclohexyl-1,4-diazepane-4-carbonyl)-4-fluorobenzyl)phthalazin-1(2H)-one | CHEMBL204348
TypeSmall organic molecule
Emp. Form.C27H31FN4O2
Mol. Mass.462.559
SMILESFc1ccc(Cc2n[nH]c(=O)c3ccccc23)cc1C(=O)N1CCCN(CC1)C1CCCCC1