Reaction Details
TargetPro-cathepsin H
LigandBDBM50148296
Substrate/Competitorn/a
Meas. Tech.ChEMBL_334150 (CHEMBL868301)
IC50 40±n/a nM
Citation Adkison, KKBarrett, DGDeaton, DNGampe, RTHassell, AMLong, STMcFadyen, RBMiller, ABMiller, LRPayne, JAShewchuk, LMWells-Knecht, KJWillard, DHWright, LL Semicarbazone-based inhibitors of cathepsin K, are they prodrugs for aldehyde inhibitors? Bioorg Med Chem Lett16:978-83 (2006) 
 
Pro-cathepsin H
Name:Pro-cathepsin H
Type:PROTEIN
Mol. Mass.:37402.31
Organism:Homo sapiens (Human)
Description:ChEMBL_1459870
Residue:335
BDBM50148296
NameBDBM50148296
Synonyms:((S)-1-Formyl-pentyl)-carbamic acid (S)-1-methyl-2-phenyl-ethyl ester CHEMBL114161
TypeSmall organic molecule
Emp. Form.C16H23NO3
Mol. Mass.277.3587
SMILESCCCC[C@H](NC(=O)O[C@@H](C)Cc1ccccc1)C=O