Reaction Details
TargetHistamine H3 receptor
LigandBDBM50177529
Substrate/Competitorn/a
Meas. Tech.ChEMBL_334179 (CHEMBL866473)
Ki 13±n/a nM
Citation Berlin, MTing, PCVaccaro, WDAslanian, RMcCormick, KDLee, JFAlbanese, MMMutahi, MWPiwinski, JJShih, NYDuguma, LSolomon, DMZhou, WSher, RFavreau, LBryant, MKorfmacher, WANardo, CWest, REAnthes, JCWilliams, SMWu, RLSusan She, HRivelli, MACorboz, MRHey, JA Reduction of CYP450 inhibition in the 4-[(1H-imidazol-4-yl)methyl]piperidine series of histamine H3 receptor antagonists. Bioorg Med Chem Lett16:989-94 (2006) 
 
Histamine H3 receptor
Name:Histamine H3 receptor
Type:Enzyme Catalytic Domain
Mol. Mass.:48753.61
Organism:GUINEA PIG
Description:HISTAMINE H3 HRH3 GUINEA PIG::Q9JI35
Residue:445
BDBM50177529
NameBDBM50177529
Synonyms:3-(4-(3-(4-((1H-imidazol-4-yl)methyl)piperidin-1-yl)propyl)phenoxy)-N,N-dimethylpropan-1-amine | CHEMBL439689
TypeSmall organic molecule
Emp. Form.C23H36N4O
Mol. Mass.384.5581
SMILESCN(C)CCCOc1ccc(CCCN2CCC(Cc3cnc[nH]3)CC2)cc1