Reaction Details
TargetHistamine H3 receptor
LigandBDBM50177528
Substrate/Competitorn/a
Meas. Tech.ChEMBL_334179 (CHEMBL866473)
Ki 12±n/a nM
Citation Berlin, MTing, PCVaccaro, WDAslanian, RMcCormick, KDLee, JFAlbanese, MMMutahi, MWPiwinski, JJShih, NYDuguma, LSolomon, DMZhou, WSher, RFavreau, LBryant, MKorfmacher, WANardo, CWest, REAnthes, JCWilliams, SMWu, RLSusan She, HRivelli, MACorboz, MRHey, JA Reduction of CYP450 inhibition in the 4-[(1H-imidazol-4-yl)methyl]piperidine series of histamine H3 receptor antagonists. Bioorg Med Chem Lett16:989-94 (2006) 
 
Histamine H3 receptor
Name:Histamine H3 receptor
Type:Enzyme Catalytic Domain
Mol. Mass.:48753.61
Organism:GUINEA PIG
Description:HISTAMINE H3 HRH3 GUINEA PIG::Q9JI35
Residue:445
BDBM50177528
NameBDBM50177528
Synonyms:1-(4-(3-(4-((1H-imidazol-4-yl)methyl)piperidin-1-yl)propoxy)phenyl)piperazine | CHEMBL437500
TypeSmall organic molecule
Emp. Form.C22H33N5O
Mol. Mass.383.5303
SMILESC(COc1ccc(cc1)N1CCNCC1)CN1CCC(Cc2cnc[nH]2)CC1