Reaction Details
TargetHistamine H3 receptor
LigandBDBM50177556
Substrate/Competitorn/a
Meas. Tech.ChEMBL_334179 (CHEMBL866473)
Ki 9±n/a nM
Citation Berlin, MTing, PCVaccaro, WDAslanian, RMcCormick, KDLee, JFAlbanese, MMMutahi, MWPiwinski, JJShih, NYDuguma, LSolomon, DMZhou, WSher, RFavreau, LBryant, MKorfmacher, WANardo, CWest, REAnthes, JCWilliams, SMWu, RLSusan She, HRivelli, MACorboz, MRHey, JA Reduction of CYP450 inhibition in the 4-[(1H-imidazol-4-yl)methyl]piperidine series of histamine H3 receptor antagonists. Bioorg Med Chem Lett16:989-94 (2006) 
 
Histamine H3 receptor
Name:Histamine H3 receptor
Type:Enzyme Catalytic Domain
Mol. Mass.:48753.61
Organism:GUINEA PIG
Description:HISTAMINE H3 HRH3 GUINEA PIG::Q9JI35
Residue:445
BDBM50177556
NameBDBM50177556
Synonyms:5-(4-(3-(4-((1H-imidazol-4-yl)methyl)piperidin-1-yl)propoxy)phenyl)pyrimidine | CHEMBL204639
TypeSmall organic molecule
Emp. Form.C22H27N5O
Mol. Mass.377.4827
SMILESC(COc1ccc(cc1)-c1cncnc1)CN1CCC(Cc2cnc[nH]2)CC1