Reaction Details
TargetMelanocortin receptor 4
LigandBDBM50177559
Substrate/Competitorn/a
Meas. Tech.ChEMBL_349444 (CHEMBL865696)
Ki 107±n/a nM
Citation Shi, QOrnstein, PLBriner, KRichardson, TIArnold, MBBacker, RTBuckmaster, JLCanada, EJDoecke, CWHertel, LWHonigschmidt, NHsiung, HMHusain, SKuklish, SLMartinelli, MJMullaney, JTO'Brien, TPReinhard, MRRothhaar, RShah, JWu, ZXie, CZgombick, JMFisher, MJ Synthesis and structure-activity relationships of novel dipeptides and reduced dipeptides as ligands for melanocortin subtype-4 receptor. Bioorg Med Chem Lett16:2341-6 (2006) 
 
Melanocortin receptor 4
Name:Melanocortin receptor 4
Type:Enzyme
Mol. Mass.:36949.50
Organism:Homo sapiens (Human)
Description:P32245
Residue:332
BDBM50177559
NameBDBM50177559
Synonyms:CHEMBL379352 | N-((R)-3-(4-chlorophenyl)-1-(4-(1-(2-chlorophenyl)-2-(diethylamino)ethyl)piperazin-1-yl)-1-oxopropan-2-yl)-2-(isoindolin-1-yl)acetamide
TypeSmall organic molecule
Emp. Form.C35H43Cl2N5O2
Mol. Mass.636.654
SMILESCCN(CC)CC(N1CCN(CC1)C(=O)[C@@H](Cc1ccc(Cl)cc1)NC(=O)CC1NCc2ccccc12)c1ccccc1Cl